{"text_format":"1","workbook":"xlsx","n_sheets":6,"sheets":["Info","Paris Compliance Test - SDA","Calculations","Metric 3","Benchmarks","Dropdown lists"],"not_rendered":{"charts":4,"images":3,"macros":1,"external_links":0,"defined_names":21,"comments":3,"pivot_tables":0},"unopened":[],"bounds":{"document_bytes":16777216,"sheet_cells":100000,"rows_first":2000,"rows_last":500,"rows_between":2000,"halvings":0,"cell_chars":16384,"cell_head_chars":4096},"cells_cut":0,"cells_raw":0,"read":"whole","date_system":"1900"}

{"sheet":"Info","index":0,"n_rows":5,"n_cols":2,"rows_kept":5,"cut":false,"hidden":false,"merged":[]}
[]
["General","In our Nature Communication publication (https://www.nature.com/articles/s41467-022-31143-4) (open access) we propose several compliance conditions and operational requirements to assess the Paris Compliance of a company, using a strict science-based approach, which are displayed on the right. This tool applies these conditions and requirements using the Sectoral Decarbonisation Approach and the IEA B2DS pathway. "]
["Data Required","To conduct the test, the following company data is required;\n- Location (OECD/Non-OECD/World)\n- Emissions (scope 1, in tCO2) since 2014 \n- Activity/Output since 2014. \nIf you do not have data since 2014, you could estimate this data instead. "]
["Maximum Action Scenario","In our Nature Communication publication, we used a \"Maximum Action Scenario\" for projecting the emissions and activity of Australian Electric Utilities. We assumed the fossil fuel assets of a company would close at the date submitted to the NEM (downloaded May 2022), the company would maintain a constant market share, and would replace their fossil fuel assets with zero carbon assets to maintain this market share. To conduct a similar analysis, you would have to compute the expected emissions for every year and enter them manually. We will include a calculation tool for this in future versions of the tool."]
["OECD countries","AUSTRALIA, AUSTRIA, BELGIUM, CANADA, CHILE, COLOMBIA, COSTA RICA, CZECH REPUBLIC, DENMARK, ESTONIA, FINLAND, FRANCE, GERMANY, GREECE, HUNGARY, ICELAND, IRELAND, ISRAEL, ITALY, JAPAN, KOREA, LATVIA, LITHUANIA, LUXEMBOURG, MEXICO, NETHERLANDS, NEW ZEALAND, NORWAY, POLAND, PORTUGAL, SLOVAK REPUBLIC, SLOVENIA, SPAIN, SWEDEN, SWITZERLAND, TURKEY, UNITED KINGDOM, UNITED STATES"]

{"sheet":"Paris Compliance Test - SDA","index":1,"n_rows":39,"n_cols":50,"rows_kept":39,"cut":false,"hidden":false,"merged":[[23,13,23,14],[7,1,7,2],[34,1,34,2],[23,11,23,12],[25,11,25,12]]}
[]
[]
[]
[]
[]
[]
[]
[null,"Step 1: Complete the following items -> "]
{"$rows_left_out":32}
{"sheet":"Calculations","index":2,"n_rows":111,"n_cols":49,"rows_kept":111,"cut":false,"hidden":false,"merged":[]}
[]
[]
[]
[]
[]
["Year",null,2014,2015,2016,2017,2018,2019,2020,2021,2022,2023,2024,2025,2026,2027,2028,2029,2030,2031,2032,2033,2034,2035,2036,2037,2038,2039,2040,2041,2042,2043,2044,2045,2046,2047,2048,2049,2050,2051,2052,2053,2054,2055,2056,2057,2058,2059,2060]
["Input Data","Unit"]
["Annual Activity",{"$f":"VLOOKUP(Sector, UnitLookup, 3, FALSE)","v":{"$error":"#N/A"}},{"$f":"IF(C6<(ActualData_End+1), 'Paris Compliance Test - SDA'!D28, 0)","v":{"$error":"#VALUE!"}},{"$f":"IF(D6<(ActualData_End+1), 'Paris Compliance Test - SDA'!E28, 0)","v":{"$error":"#VALUE!"}},{"$f":"IF(E6<(ActualData_End+1), 'Paris Compliance Test - SDA'!F28, 0)","v":{"$error":"#VALUE!"}},{"$f":"IF(F6<(ActualData_End+1), 'Paris Compliance Test - SDA'!G28, 0)","v":{"$error":"#VALUE!"}},{"$f":"IF(G6<(ActualData_End+1), 'Paris Compliance Test - SDA'!H28, 0)","v":{"$error":"#VALUE!"}},{"$f":"IF(H6<(ActualData_End+1), 'Paris Compliance Test - SDA'!I28, 0)","v":{"$error":"#VALUE!"}},{"$f":"IF(I6<(ActualData_End+1), 'Paris Compliance Test - SDA'!J28, 0)","v":{"$error":"#VALUE!"}},{"$f":"IF(J6<(ActualData_End+1), 'Paris Compliance Test - SDA'!K28, 0)","v":{"$error":"#VALUE!"}},{"$f":"IF(K6<(ActualData_End+1), 'Paris Compliance Test - SDA'!L28, 0)","v":{"$error":"#VALUE!"}},{"$f":"IF(L6<(ActualData_End+1), 'Paris Compliance Test - SDA'!M28, 0)","v":{"$error":"#VALUE!"}},{"$f":"IF(M6<(ActualData_End+1), 'Paris Compliance Test - SDA'!N28, 0)","v":{"$error":"#VALUE!"}},{"$f":"IF(N6<(ActualData_End+1), 'Paris Compliance Test - SDA'!O28, 0)","v":{"$error":"#VALUE!"}},{"$f":"IF(O6<(ActualData_End+1), 'Paris Compliance Test - SDA'!P28, 0)","v":{"$error":"#VALUE!"}},{"$f":"IF(P6<(ActualData_End+1), 'Paris Compliance Test - SDA'!Q28, 0)","v":{"$error":"#VALUE!"}},{"$f":"IF(Q6<(ActualData_End+1), 'Paris Compliance Test - SDA'!R28, 0)","v":{"$error":"#VALUE!"}},{"$f":"IF(R6<(ActualData_End+1), 'Paris Compliance Test - SDA'!S28, 0)","v":{"$error":"#VALUE!"}},{"$f":"IF(S6<(ActualData_End+1), 'Paris Compliance Test - SDA'!T28, 0)","v":{"$error":"#VALUE!"}},{"$f":"IF(T6<(ActualData_End+1), 'Paris Compliance Test - SDA'!U28, 0)","v":{"$error":"#VALUE!"}},{"$f":"IF(U6<(ActualData_End+1), 'Paris Compliance Test - SDA'!V28, 0)","v":{"$error":"#VALUE!"}},{"$f":"IF(V6<(ActualData_End+1), 'Paris Compliance Test - SDA'!W28, 0)","v":{"$error":"#VALUE!"}},{"$f":"IF(W6<(ActualData_End+1), 'Paris Compliance Test - SDA'!X28, 0)","v":{"$error":"#VALUE!"}},{"$f":"IF(X6<(ActualData_End+1), 'Paris Compliance Test - SDA'!Y28, 0)","v":{"$error":"#VALUE!"}},{"$f":"IF(Y6<(ActualData_End+1), 'Paris Compliance Test - SDA'!Z28, 0)","v":{"$error":"#VALUE!"}},{"$f":"IF(Z6<(ActualData_End+1), 'Paris Compliance Test - SDA'!AA28, 0)","v":{"$error":"#VALUE!"}},{"$f":"IF(AA6<(ActualData_End+1), 'Paris Compliance Test - SDA'!AB28, 0)","v":{"$error":"#VALUE!"}},{"$f":"IF(AB6<(ActualData_End+1), 'Paris Compliance Test - SDA'!AC28, 0)","v":{"$error":"#VALUE!"}},{"$f":"IF(AC6<(ActualData_End+1), 'Paris Compliance Test - SDA'!AD28, 0)","v":{"$error":"#VALUE!"}},{"$f":"IF(AD6<(ActualData_End+1), 'Paris Compliance Test - SDA'!AE28, 0)","v":{"$error":"#VALUE!"}},{"$f":"IF(AE6<(ActualData_End+1), 'Paris Compliance Test - SDA'!AF28, 0)","v":{"$error":"#VALUE!"}},{"$f":"IF(AF6<(ActualData_End+1), 'Paris Compliance Test - SDA'!AG28, 0)","v":{"$error":"#VALUE!"}},{"$f":"IF(AG6<(ActualData_End+1), 'Paris Compliance Test - SDA'!AH28, 0)","v":{"$error":"#VALUE!"}},{"$f":"IF(AH6<(ActualData_End+1), 'Paris Compliance Test - SDA'!AI28, 0)","v":{"$error":"#VALUE!"}},{"$f":"IF(AI6<(ActualData_End+1), 'Paris Compliance Test - SDA'!AJ28, 0)","v":{"$error":"#VALUE!"}},{"$f":"IF(AJ6<(ActualData_End+1), 'Paris Compliance Test - SDA'!AK28, 0)","v":{"$error":"#VALUE!"}},{"$f":"IF(AK6<(ActualData_End+1), 'Paris Compliance Test - SDA'!AL28, 0)","v":{"$error":"#VALUE!"}},{"$f":"IF(AL6<(ActualData_End+1), 'Paris Compliance Test - SDA'!AM28, 0)","v":{"$error":"#VALUE!"}},{"$f":"IF(AM6<(ActualData_End+1), 'Paris Compliance Test - SDA'!AN28, 0)","v":{"$error":"#VALUE!"}},{"$f":"IF(AN6<(ActualData_End+1), 'Paris Compliance Test - SDA'!AO28, 0)","v":{"$error":"#VALUE!"}},{"$f":"IF(AO6<(ActualData_End+1), 'Paris Compliance Test - SDA'!AP28, 0)","v":{"$error":"#VALUE!"}},{"$f":"IF(AP6<(ActualData_End+1), 'Paris Compliance Test - SDA'!AQ28, 0)","v":{"$error":"#VALUE!"}},{"$f":"IF(AQ6<(ActualData_End+1), 'Paris Compliance Test - SDA'!AR28, 0)","v":{"$error":"#VALUE!"}},{"$f":"IF(AR6<(ActualData_End+1), 'Paris Compliance Test - SDA'!AS28, 0)","v":{"$error":"#VALUE!"}},{"$f":"IF(AS6<(ActualData_End+1), 'Paris Compliance Test - SDA'!AT28, 0)","v":{"$error":"#VALUE!"}},{"$f":"IF(AT6<(ActualData_End+1), 'Paris Compliance Test - SDA'!AU28, 0)","v":{"$error":"#VALUE!"}},{"$f":"IF(AU6<(ActualData_End+1), 'Paris Compliance Test - SDA'!AV28, 0)","v":{"$error":"#VALUE!"}},{"$f":"IF(AV6<(ActualData_End+1), 'Paris Compliance Test - SDA'!AW28, 0)","v":{"$error":"#VALUE!"}},{"$f":"IF(AW6<(ActualData_End+1), 'Paris Compliance Test - SDA'!AX28, 0)","v":{"$error":"#VALUE!"}}]
{"$rows_left_out":104}
{"sheet":"Metric 3","index":3,"n_rows":36,"n_cols":51,"rows_kept":36,"cut":false,"hidden":false,"merged":[]}
["Year",2014,2015,2016,2017,2018,2019,2020,2021,2022,2023,2024,2025,2026,2027,2028,2029,2030,2031,2032,2033,2034,2035,2036,2037,2038,2039,2040,2041,2042,2043,2044,2045,2046,2047,2048,2049,2050,2051,2052,2053,2054,2055,2056,2057,2058,2059,2060]
["Remaining Carbon Budget",{"$f":"INDEX(Calculations!C46:AW46, 1,MATCH(ActualData_End, Calculations!C6:AW6,0))","v":{"$error":"#N/A"}}]
["PCPintensity (base year 2014)",{"$f":"IF(B1<(ActualData_End+1), Calculations!C28, Calculations!C40)","v":{"$error":"#VALUE!"}},{"$f":"IF(C1<(ActualData_End+1), Calculations!D28, Calculations!D40)","v":{"$error":"#VALUE!"}},{"$f":"IF(D1<(ActualData_End+1), Calculations!E28, Calculations!E40)","v":{"$error":"#VALUE!"}},{"$f":"IF(E1<(ActualData_End+1), Calculations!F28, Calculations!F40)","v":{"$error":"#VALUE!"}},{"$f":"IF(F1<(ActualData_End+1), Calculations!G28, Calculations!G40)","v":{"$error":"#VALUE!"}},{"$f":"IF(G1<(ActualData_End+1), Calculations!H28, Calculations!H40)","v":{"$error":"#VALUE!"}},{"$f":"IF(H1<(ActualData_End+1), Calculations!I28, Calculations!I40)","v":{"$error":"#VALUE!"}},{"$f":"IF(I1<(ActualData_End+1), Calculations!J28, Calculations!J40)","v":{"$error":"#VALUE!"}},{"$f":"IF(J1<(ActualData_End+1), Calculations!K28, Calculations!K40)","v":{"$error":"#VALUE!"}},{"$f":"IF(K1<(ActualData_End+1), Calculations!L28, Calculations!L40)","v":{"$error":"#VALUE!"}},{"$f":"IF(L1<(ActualData_End+1), Calculations!M28, Calculations!M40)","v":{"$error":"#VALUE!"}},{"$f":"IF(M1<(ActualData_End+1), Calculations!N28, Calculations!N40)","v":{"$error":"#VALUE!"}},{"$f":"IF(N1<(ActualData_End+1), Calculations!O28, Calculations!O40)","v":{"$error":"#VALUE!"}},{"$f":"IF(O1<(ActualData_End+1), Calculations!P28, Calculations!P40)","v":{"$error":"#VALUE!"}},{"$f":"IF(P1<(ActualData_End+1), Calculations!Q28, Calculations!Q40)","v":{"$error":"#VALUE!"}},{"$f":"IF(Q1<(ActualData_End+1), Calculations!R28, Calculations!R40)","v":{"$error":"#VALUE!"}},{"$f":"IF(R1<(ActualData_End+1), Calculations!S28, Calculations!S40)","v":{"$error":"#VALUE!"}},{"$f":"IF(S1<(ActualData_End+1), Calculations!T28, Calculations!T40)","v":{"$error":"#VALUE!"}},{"$f":"IF(T1<(ActualData_End+1), Calculations!U28, Calculations!U40)","v":{"$error":"#VALUE!"}},{"$f":"IF(U1<(ActualData_End+1), Calculations!V28, Calculations!V40)","v":{"$error":"#VALUE!"}},{"$f":"IF(V1<(ActualData_End+1), Calculations!W28, Calculations!W40)","v":{"$error":"#VALUE!"}},{"$f":"IF(W1<(ActualData_End+1), Calculations!X28, Calculations!X40)","v":{"$error":"#VALUE!"}},{"$f":"IF(X1<(ActualData_End+1), Calculations!Y28, Calculations!Y40)","v":{"$error":"#VALUE!"}},{"$f":"IF(Y1<(ActualData_End+1), Calculations!Z28, Calculations!Z40)","v":{"$error":"#VALUE!"}},{"$f":"IF(Z1<(ActualData_End+1), Calculations!AA28, Calculations!AA40)","v":{"$error":"#VALUE!"}},{"$f":"IF(AA1<(ActualData_End+1), Calculations!AB28, Calculations!AB40)","v":{"$error":"#VALUE!"}},{"$f":"IF(AB1<(ActualData_End+1), Calculations!AC28, Calculations!AC40)","v":{"$error":"#VALUE!"}},{"$f":"IF(AC1<(ActualData_End+1), Calculations!AD28, Calculations!AD40)","v":{"$error":"#VALUE!"}},{"$f":"IF(AD1<(ActualData_End+1), Calculations!AE28, Calculations!AE40)","v":{"$error":"#VALUE!"}},{"$f":"IF(AE1<(ActualData_End+1), Calculations!AF28, Calculations!AF40)","v":{"$error":"#VALUE!"}},{"$f":"IF(AF1<(ActualData_End+1), Calculations!AG28, Calculations!AG40)","v":{"$error":"#VALUE!"}},{"$f":"IF(AG1<(ActualData_End+1), Calculations!AH28, Calculations!AH40)","v":{"$error":"#VALUE!"}},{"$f":"IF(AH1<(ActualData_End+1), Calculations!AI28, Calculations!AI40)","v":{"$error":"#VALUE!"}},{"$f":"IF(AI1<(ActualData_End+1), Calculations!AJ28, Calculations!AJ40)","v":{"$error":"#VALUE!"}},{"$f":"IF(AJ1<(ActualData_End+1), Calculations!AK28, Calculations!AK40)","v":{"$error":"#VALUE!"}},{"$f":"IF(AK1<(ActualData_End+1), Calculations!AL28, Calculations!AL40)","v":{"$error":"#VALUE!"}},{"$f":"IF(AL1<(ActualData_End+1), Calculations!AM28, Calculations!AM40)","v":{"$error":"#VALUE!"}},{"$f":"IF(AM1<(ActualData_End+1), Calculations!AN28, Calculations!AN40)","v":{"$error":"#VALUE!"}},{"$f":"IF(AN1<(ActualData_End+1), Calculations!AO28, Calculations!AO40)","v":{"$error":"#VALUE!"}},{"$f":"IF(AO1<(ActualData_End+1), Calculations!AP28, Calculations!AP40)","v":{"$error":"#VALUE!"}},{"$f":"IF(AP1<(ActualData_End+1), Calculations!AQ28, Calculations!AQ40)","v":{"$error":"#VALUE!"}},{"$f":"IF(AQ1<(ActualData_End+1), Calculations!AR28, Calculations!AR40)","v":{"$error":"#VALUE!"}},{"$f":"IF(AR1<(ActualData_End+1), Calculations!AS28, Calculations!AS40)","v":{"$error":"#VALUE!"}},{"$f":"IF(AS1<(ActualData_End+1), Calculations!AT28, Calculations!AT40)","v":{"$error":"#VALUE!"}},{"$f":"IF(AT1<(ActualData_End+1), Calculations!AU28, Calculations!AU40)","v":{"$error":"#VALUE!"}},{"$f":"IF(AU1<(ActualData_End+1), Calculations!AV28, Calculations!AV40)","v":{"$error":"#VALUE!"}},{"$f":"IF(AV1<(ActualData_End+1), Calculations!AW28, Calculations!AW40)","v":{"$error":"#VALUE!"}}]
["Annual Activity (MWh) Projected Constant Market share World",{"$f":"Calculations!C38","v":{"$error":"#VALUE!"}},{"$f":"Calculations!D38","v":{"$error":"#VALUE!"}},{"$f":"Calculations!E38","v":{"$error":"#VALUE!"}},{"$f":"Calculations!F38","v":{"$error":"#VALUE!"}},{"$f":"Calculations!G38","v":{"$error":"#VALUE!"}},{"$f":"Calculations!H38","v":{"$error":"#VALUE!"}},{"$f":"Calculations!I38","v":{"$error":"#VALUE!"}},{"$f":"Calculations!J38","v":{"$error":"#VALUE!"}},{"$f":"Calculations!K38","v":{"$error":"#VALUE!"}},{"$f":"Calculations!L38","v":{"$error":"#VALUE!"}},{"$f":"Calculations!M38","v":{"$error":"#VALUE!"}},{"$f":"Calculations!N38","v":{"$error":"#VALUE!"}},{"$f":"Calculations!O38","v":{"$error":"#VALUE!"}},{"$f":"Calculations!P38","v":{"$error":"#VALUE!"}},{"$f":"Calculations!Q38","v":{"$error":"#VALUE!"}},{"$f":"Calculations!R38","v":{"$error":"#VALUE!"}},{"$f":"Calculations!S38","v":{"$error":"#VALUE!"}},{"$f":"Calculations!T38","v":{"$error":"#VALUE!"}},{"$f":"Calculations!U38","v":{"$error":"#VALUE!"}},{"$f":"Calculations!V38","v":{"$error":"#VALUE!"}},{"$f":"Calculations!W38","v":{"$error":"#VALUE!"}},{"$f":"Calculations!X38","v":{"$error":"#VALUE!"}},{"$f":"Calculations!Y38","v":{"$error":"#VALUE!"}},{"$f":"Calculations!Z38","v":{"$error":"#VALUE!"}},{"$f":"Calculations!AA38","v":{"$error":"#VALUE!"}},{"$f":"Calculations!AB38","v":{"$error":"#VALUE!"}},{"$f":"Calculations!AC38","v":{"$error":"#VALUE!"}},{"$f":"Calculations!AD38","v":{"$error":"#VALUE!"}},{"$f":"Calculations!AE38","v":{"$error":"#VALUE!"}},{"$f":"Calculations!AF38","v":{"$error":"#VALUE!"}},{"$f":"Calculations!AG38","v":{"$error":"#VALUE!"}},{"$f":"Calculations!AH38","v":{"$error":"#VALUE!"}},{"$f":"Calculations!AI38","v":{"$error":"#VALUE!"}},{"$f":"Calculations!AJ38","v":{"$error":"#VALUE!"}},{"$f":"Calculations!AK38","v":{"$error":"#VALUE!"}},{"$f":"Calculations!AL38","v":{"$error":"#VALUE!"}},{"$f":"Calculations!AM38","v":{"$error":"#VALUE!"}},{"$f":"Calculations!AN38","v":{"$error":"#VALUE!"}},{"$f":"Calculations!AO38","v":{"$error":"#VALUE!"}},{"$f":"Calculations!AP38","v":{"$error":"#VALUE!"}},{"$f":"Calculations!AQ38","v":{"$error":"#VALUE!"}},{"$f":"Calculations!AR38","v":{"$error":"#VALUE!"}},{"$f":"Calculations!AS38","v":{"$error":"#VALUE!"}},{"$f":"Calculations!AT38","v":{"$error":"#VALUE!"}},{"$f":"Calculations!AU38","v":{"$error":"#VALUE!"}},{"$f":"Calculations!AV38","v":{"$error":"#VALUE!"}},{"$f":"Calculations!AW38","v":{"$error":"#VALUE!"}}]
["Emissions (Using revised carbon intensity below - to solve) Power Generation",{"$f":"B13*B4","v":{"$error":"#VALUE!"}},{"$f":"C13*C4","v":{"$error":"#VALUE!"}},{"$error":"#VALUE!"},{"$error":"#VALUE!"},{"$error":"#VALUE!"},{"$error":"#VALUE!"},{"$f":"H13*H4","v":{"$error":"#VALUE!"}},{"$f":"I13*I4","v":{"$error":"#VALUE!"}},{"$error":"#VALUE!"},{"$f":"K13*K4","v":{"$error":"#VALUE!"}},{"$f":"L13*L4","v":{"$error":"#VALUE!"}},{"$f":"M13*M4","v":{"$error":"#VALUE!"}},{"$f":"N13*N4","v":{"$error":"#VALUE!"}},{"$f":"O13*O4","v":{"$error":"#VALUE!"}},{"$error":"#VALUE!"},{"$f":"Q13*Q4","v":{"$error":"#VALUE!"}},{"$error":"#VALUE!"},{"$f":"S13*S4","v":{"$error":"#VALUE!"}},{"$f":"T13*T4","v":{"$error":"#VALUE!"}},{"$f":"U13*U4","v":{"$error":"#VALUE!"}},{"$f":"V13*V4","v":{"$error":"#VALUE!"}},{"$f":"W13*W4","v":{"$error":"#VALUE!"}},{"$error":"#VALUE!"},{"$f":"Y13*Y4","v":{"$error":"#VALUE!"}},{"$error":"#VALUE!"},{"$f":"AA13*AA4","v":{"$error":"#VALUE!"}},{"$f":"AB13*AB4","v":{"$error":"#VALUE!"}},{"$f":"AC13*AC4","v":{"$error":"#VALUE!"}},{"$f":"AD13*AD4","v":{"$error":"#VALUE!"}},{"$f":"AE13*AE4","v":{"$error":"#VALUE!"}},{"$error":"#VALUE!"},{"$f":"AG13*AG4","v":{"$error":"#VALUE!"}},{"$error":"#VALUE!"},{"$f":"AI13*AI4","v":{"$error":"#VALUE!"}},{"$f":"AJ13*AJ4","v":{"$error":"#VALUE!"}},{"$f":"AK13*AK4","v":{"$error":"#VALUE!"}},{"$f":"AL13*AL4","v":{"$error":"#VALUE!"}},{"$f":"AM13*AM4","v":{"$error":"#VALUE!"}},{"$error":"#VALUE!"},{"$f":"AO13*AO4","v":{"$error":"#VALUE!"}},{"$error":"#VALUE!"},{"$f":"AQ13*AQ4","v":{"$error":"#VALUE!"}},{"$f":"AR13*AR4","v":{"$error":"#VALUE!"}},{"$f":"AS13*AS4","v":{"$error":"#VALUE!"}},{"$f":"AT13*AT4","v":{"$error":"#VALUE!"}},{"$f":"AU13*AU4","v":{"$error":"#VALUE!"}},{"$error":"#VALUE!"}]
["Emissions (Using revised carbon intensity below - to solve) Other sectors",{"$f":"B14*B4","v":{"$error":"#VALUE!"}},{"$f":"C14*C4","v":{"$error":"#VALUE!"}},{"$error":"#VALUE!"},{"$error":"#VALUE!"},{"$error":"#VALUE!"},{"$error":"#VALUE!"},{"$error":"#VALUE!"},{"$error":"#VALUE!"},{"$error":"#VALUE!"},{"$error":"#VALUE!"},{"$error":"#VALUE!"},{"$error":"#VALUE!"},{"$error":"#VALUE!"},{"$error":"#VALUE!"},{"$error":"#VALUE!"},{"$error":"#VALUE!"},{"$error":"#VALUE!"},{"$error":"#VALUE!"},{"$error":"#VALUE!"},{"$error":"#VALUE!"},{"$error":"#VALUE!"},{"$error":"#VALUE!"},{"$error":"#VALUE!"},{"$error":"#VALUE!"},{"$error":"#VALUE!"},{"$error":"#VALUE!"},{"$error":"#VALUE!"},{"$error":"#VALUE!"},{"$error":"#VALUE!"},{"$error":"#VALUE!"},{"$error":"#VALUE!"},{"$error":"#VALUE!"},{"$error":"#VALUE!"},{"$error":"#VALUE!"},{"$error":"#VALUE!"},{"$error":"#VALUE!"},{"$error":"#VALUE!"},{"$error":"#VALUE!"},{"$error":"#VALUE!"},{"$error":"#VALUE!"},{"$error":"#VALUE!"},{"$error":"#VALUE!"},{"$error":"#VALUE!"},{"$error":"#VALUE!"},{"$error":"#VALUE!"},{"$error":"#VALUE!"},{"$error":"#VALUE!"}]
["Projected Cumulative Emissions (from last reported data year) Power Generation",{"$f":"IF(B1<(ActualData_End),0,IF(B1>(ActualData_End-1),B5+A7,0))","v":0},0,0,0,0,0,0,0,0,0,0,0,0,0,0,0,0,0,0,0,0,0,0,0,0,0,0,0,0,0,0,0,0,0,0,0,0,0,0,0,0,0,0,0,0,0,0]
["Projected Cumulative Emissions (from last reported data year) Other sectors",{"$f":"IF(B1<(ActualData_End),0,IF(B1>(ActualData_End-1),B6+A8,0))","v":0},0,0,0,0,0,0,0,0,0,0,0,0,0,0,0,0,0,0,0,0,0,0,0,0,0,0,0,0,0,0,0,0,0,0,0,0,0,0,0,0,0,0,0,0,0,0]
{"$rows_left_out":29}
{"sheet":"Benchmarks","index":4,"n_rows":103,"n_cols":15,"rows_kept":103,"cut":false,"hidden":true,"merged":[[1,14,18,16],[64,14,81,16]]}
["Sector","Source","Type Data","Unit","Region",2014,2025,2030,2035,2040,2045,2050,2055,2060]
["Aluminium","IEA - B2DS (ETP2017) - industry","Scope 1 Intensity","tCO2/tAluminium","Non-OECD",2.4016864613792634,1.9902619948919846,1.7087969088978945,1.4850655756041058,1.2768574271185786,1.07393776277997,0.86852372772490061,0.67650129748652832,0.62081872349314826,"Always change back order to having intensities in rows 2-19 (otherwise amend formula in Calculations - C10)"]
["Aluminium","IEA - B2DS (ETP2017) - industry","Scope 1 Intensity","tCO2/tAluminium","OECD",1.2818849327207467,1.4673393238502548,1.4944477868775938,1.5262478369929662,1.5518880811607316,1.4840317806626193,1.450986700689201,1.3680436371318776,1.2744735609851934]
["Aluminium","IEA - B2DS (ETP2017) - industry","Scope 1 Intensity","tCO2/tAluminium","World",2.0639175553134463,1.8681767775761511,1.6636068954518357,1.4930911240193143,1.3286180752665129,1.151154092286103,0.97923024514042178,0.80892128375893979,0.74702512503346852]
["Cement","IEA - B2DS (ETP2017) - industry","Scope 1 Intensity","tCO2/tCement","Non-OECD",0.51959158807826178,0.46270445632853585,0.39845493557693834,0.33980810011297541,0.26903044092474798,0.23551098542895618,0.16688070836346222,0.14408850927925895,9.9032462503435045E-2]
["Cement","IEA - B2DS (ETP2017) - industry","Scope 1 Intensity","tCO2/tCement","OECD",0.64432697559354279,0.5327649380406394,0.48457701750383064,0.39914551428389761,0.3235740010161387,0.28430742360132211,0.19530810499043785,0.15304892126138661,9.4196784666336242E-2]
["Cement","IEA - B2DS (ETP2017) - industry","Scope 1 Intensity","tCO2/tCement","World",0.53411625171297805,0.47075683976957439,0.40840182327191937,0.34669752735708143,0.27506146499146583,0.24076478985956259,0.16991403492521551,0.14505236725717471,9.8502410529485634E-2]
["Chemicals and petrochemicals","IEA - B2DS (ETP2017) - industry","Scope 1 Intensity","tCO2/tChemicals & petrochemicals","Non-OECD",2.036392163082271,1.5240101975059885,1.2258520341978707,1.021109566410759,0.83621873943560832,0.67157740820649492,0.52738745718638969,0.40348347579150096,0.31606174302879542]
{"$rows_left_out":96}
{"sheet":"Dropdown lists","index":5,"n_rows":81,"n_cols":4,"rows_kept":81,"cut":false,"hidden":true,"merged":[]}
["Lists"]
["<Please select>"]
["IEA B2DS"]
[]
[]
["<Please select>"]
["OECD"]
["non-OECD"]
{"$rows_left_out":73}